BDBM289196 US10093660, Example 2.25
SMILES Cc1cc(cc2ncnc(Nc3cccnc3O[C@H]3COC[C@H]3OCCF)c12)N=S1(=O)CCCC1
InChI Key InChIKey=WPRQIYVTQUOMGG-RTWAWAEBSA-N
Data  2 IC50
  Tab Delimited (TSV)   2D SDfile   Computed 3D by Vconf -m prep SDfile
Find this compound or compounds like it in BindingDB:
Activity Spreadsheet -- Enzyme Inhibition Constant Data from BindingDB
Found 2 hits for monomerid = 289196
TargetMAP kinase-interacting serine/threonine-protein kinase 1(Homo sapiens (Human))
Evotec Internatonal
US Patent
LigandPNGBDBM289196(US10093660, Example 2.25)
Affinity DataIC50:  46nM. Assay description: MNK1 Data can be obtained from the MNK1 Z′-LYTEŽ assay. The MNK1 Z′-LYTEŽ screening protocol and assay conditions are also described on w...
Ligand InfoPC cidPC sid
In DepthDetails US Patent
TargetMAP kinase-interacting serine/threonine-protein kinase 2(Homo sapiens (Human))
Evotec Internatonal
US Patent
LigandPNGBDBM289196(US10093660, Example 2.25)
Affinity DataIC50:  2nMT: 2°C. Assay description: ASSAY SETUP: The inhibition of kinase activity of MNK2a was assessed using pre-activated GST-MNK2a. The white, 384-well OptiPlate F plates were purch...
Ligand InfoPC cidPC sid
In DepthDetails US Patent