BDBM289257 US10093660, Example 2.63
SMILES CO[C@@H]1CC[C@H](CO1)Oc1cc(F)ccc1Nc1ncnc2cc(cc(C)c12)N=S(C)(C)=O
InChI Key InChIKey=TZCDLAUGYIFQQK-UTKZUKDTSA-N
Data  1 IC50
  Tab Delimited (TSV)   2D SDfile   Computed 3D by Vconf -m prep SDfile
Find this compound or compounds like it in BindingDB:
Activity Spreadsheet -- Enzyme Inhibition Constant Data from BindingDB
Found 1 hit for monomerid = 289257
TargetMAP kinase-interacting serine/threonine-protein kinase 2(Homo sapiens (Human))
Evotec Internatonal
US Patent
LigandPNGBDBM289257(US10093660, Example 2.63)
Affinity DataIC50:  2nMT: 2°C. Assay description: ASSAY SETUP: The inhibition of kinase activity of MNK2a was assessed using pre-activated GST-MNK2a. The white, 384-well OptiPlate F plates were purch...
Ligand InfoPC cidPC sid
In DepthDetails US Patent