BDBM289277 4-[1-(4-Amino-3-methyl-1H- pyrazolo[3,4-d]pyrimidin-1- yl)ethyl]-6-chloro-3-methoxy-2-[1- (tetrahydrofuran-3- ylmethyl)azetidin-3-yl]benzonitrile (from peak 1)5::US10092570, Example 278
SMILES COc1c(cc(Cl)c(C#N)c1C1CN(C[C@@H]2CCOC2)C1)C(C)n1nc(C)c2c(N)ncnc12
InChI Key InChIKey=YBYXGBFFGVXBNK-LOACHALJSA-N
Data  1 IC50
  Tab Delimited (TSV)   2D SDfile   Computed 3D by Vconf -m prep SDfile
Find this compound or compounds like it in BindingDB:
Activity Spreadsheet -- Enzyme Inhibition Constant Data from BindingDB
Found 1 hit for monomerid = 289277
TargetPhosphatidylinositol 4,5-bisphosphate 3-kinase catalytic subunit delta isoform(Homo sapiens (Human))
Incyte Holdings
US Patent
LigandPNGBDBM289277(4-[1-(4-Amino-3-methyl-1H- pyrazolo[3,4-d]pyrimidi...)
Affinity DataIC50: <10nMpH: 6.7 T: 2°C. Assay description: [γ-33P]ATP (10 mCi/mL) was purchased from Perkin-Elmer (Waltham, Mass.). Lipid kinase substrate, D-myo-Phosphatidylinositol 4,5-bisphosphate (Pt...
Ligand InfoPC cidPC sid
In DepthDetails US Patent