BDBM289468 5-(2-cyclopentyl-1-(3- morpholinobicyclo- [1.1.1]pentan-1-yl)-1H- imidazol-4-yl)-3- (trifluoromethoxy)- pyridin-2-amine::US10093664, Example 44
SMILES Nc1ncc(cc1OC(F)(F)F)-c1cn(c(n1)C1CCCC1)C12CC(C1)(C2)N1CCOCC1
InChI Key InChIKey=OBDJSNRLVWBBIF-UHFFFAOYSA-N
Data  1 Kd
  Tab Delimited (TSV)   2D SDfile   Computed 3D by Vconf -m prep SDfile
Find this compound or compounds like it in BindingDB:
Activity Spreadsheet -- Enzyme Inhibition Constant Data from BindingDB
Found 1 hit for monomerid = 289468
TargetMitogen-activated protein kinase kinase kinase 12(Homo sapiens (Human))
The University Of Texas System
US Patent
LigandPNGBDBM289468(5-(2-cyclopentyl-1-(3- morpholinobicyclo- [1.1.1]p...)
Affinity DataKd:  53nM. Assay description: The DLK dissociation constants (Kd) have been determined in the KINOMEscan KdELECT Service at DiscoveRx. A fusion protein of full length of human DLK...
Ligand InfoPC cidPC sid
In DepthDetails US Patent