BDBM289482 (4-(6-amino-5-(trifluoro- methyl)pyridin-3-yl)- 1-(bicyclo[1.1.1]- pentan-1-yl)-1H-imid- azol-2-yl)methanol::US10093664, Example 58
SMILES Nc1ncc(cc1C(F)(F)F)-c1cn(c(CO)n1)C12CC(C1)C2
InChI Key InChIKey=PRLDMNHZQFZQTE-UHFFFAOYSA-N
Data  1 Kd
  Tab Delimited (TSV)   2D SDfile   Computed 3D by Vconf -m prep SDfile
Find this compound or compounds like it in BindingDB:
Activity Spreadsheet -- Enzyme Inhibition Constant Data from BindingDB
Found 1 hit for monomerid = 289482
TargetMitogen-activated protein kinase kinase kinase 12(Homo sapiens (Human))
The University Of Texas System
US Patent
LigandPNGBDBM289482((4-(6-amino-5-(trifluoro- methyl)pyridin-3-yl)- 1-...)
Affinity DataKd:  18nM. Assay description: The DLK dissociation constants (Kd) have been determined in the KINOMEscan KdELECT Service at DiscoveRx. A fusion protein of full length of human DLK...
Ligand InfoPC cidPC sid
In DepthDetails US Patent