BDBM289489 1-(4-(6-amino-5-(tri- fluoromethyl)pyridin-3- yl)-1-(bicyclo[1.1.1]- pentan-1-yl)-1H-imid- azol-2-yl)propan-1-ol::US10093664, Example 61
SMILES CCC(O)c1nc(cn1C12CC(C1)C2)-c1cnc(N)c(c1)C(F)(F)F
InChI Key InChIKey=FZSXZWYIJITCTQ-UHFFFAOYSA-N
Data  1 Kd
  Tab Delimited (TSV)   2D SDfile   Computed 3D by Vconf -m prep SDfile
Find this compound or compounds like it in BindingDB:
Activity Spreadsheet -- Enzyme Inhibition Constant Data from BindingDB
Found 1 hit for monomerid = 289489
TargetMitogen-activated protein kinase kinase kinase 12(Homo sapiens (Human))
The University Of Texas System
US Patent
LigandPNGBDBM289489(1-(4-(6-amino-5-(tri- fluoromethyl)pyridin-3- yl)-...)
Affinity DataKd:  2.10nM. Assay description: The DLK dissociation constants (Kd) have been determined in the KINOMEscan KdELECT Service at DiscoveRx. A fusion protein of full length of human DLK...
Ligand InfoPC cidPC sid
In DepthDetails US Patent