BDBM289494 4-(6-amino-5-(trifluoro- methoxy)pyridin-3- yl)-1-(3-morpholino- bicyclo[1.1.1]pentan-1- yl)-1H-imidazole-2- carbaldehyde::US10093664, Example 66
SMILES Nc1ncc(cc1OC(F)(F)F)-c1cn(c(C=O)n1)C12CC(C1)(C2)N1CCOCC1
InChI Key InChIKey=VLJFJQKINQBDGN-UHFFFAOYSA-N
Data  1 Kd
  Tab Delimited (TSV)   2D SDfile   Computed 3D by Vconf -m prep SDfile
Find this compound or compounds like it in BindingDB:
Activity Spreadsheet -- Enzyme Inhibition Constant Data from BindingDB
Found 1 hit for monomerid = 289494
TargetMitogen-activated protein kinase kinase kinase 12(Homo sapiens (Human))
The University Of Texas System
US Patent
LigandPNGBDBM289494(4-(6-amino-5-(trifluoro- methoxy)pyridin-3- yl)-1-...)
Affinity DataKd:  44nM. Assay description: The DLK dissociation constants (Kd) have been determined in the KINOMEscan KdELECT Service at DiscoveRx. A fusion protein of full length of human DLK...
Ligand InfoPC cidPC sid
In DepthDetails US Patent