BDBM289885 1-{6-[5-(2H-Pyrazol-3-yl)-pyrimidin- 2-yloxy]-naphthalen-2-ylmethyl}- piperidin-4-ol::US9573957, Example 26
SMILES OC1CCN(Cc2ccc3cc(Oc4ncc(cn4)-c4ccn[nH]4)ccc3c2)CC1
InChI Key InChIKey=BJNKLGUGSBIOPY-UHFFFAOYSA-N
Data  1 IC50
  Tab Delimited (TSV)   2D SDfile   Computed 3D by Vconf -m prep SDfile
Find this compound or compounds like it in BindingDB:
Activity Spreadsheet -- Enzyme Inhibition Constant Data from BindingDB
Found 1 hit for monomerid = 289885
TargetLeukotriene A-4 hydrolase(Homo sapiens (Human))
Boehringer Ingelheim International
US Patent
LigandPNGBDBM289885(1-{6-[5-(2H-Pyrazol-3-yl)-pyrimidin- 2-yloxy]-naph...)
Affinity DataIC50:  2.30nMpH: 7.5 T: 2°C. Assay description: The compounds of the invention are assessed for the ability to interact with human LTA4 hydrolase in an enzymatic assay that measures the ability of ...
Ligand InfoPC cidPC sid
In DepthDetails US Patent