BDBM289943 (S)-2-Hydroxy-1-[4-(2-{6-[5-(2H- pyrazol-3-yl)-pyridin-2-yloxy]- benzofuran-3-yl}-ethyl)-piperazin- 1-yl]-propan-1-one::US9573957, Example 83
SMILES C[C@H](O)C(=O)N1CCN(CCc2coc3cc(Oc4ccc(cn4)-c4ccn[nH]4)ccc23)CC1
InChI Key
Data  1 IC50
  Tab Delimited (TSV)   2D SDfile   Computed 3D by Vconf -m prep SDfile
Find this compound or compounds like it in BindingDB:
Activity Spreadsheet -- Enzyme Inhibition Constant Data from BindingDB
Found 1 hit for monomerid = 289943
TargetLeukotriene A-4 hydrolase(Homo sapiens (Human))
Boehringer Ingelheim International
US Patent
LigandPNGBDBM289943((S)-2-Hydroxy-1-[4-(2-{6-[5-(2H- pyrazol-3-yl)-pyr...)
Affinity DataIC50:  0.860nMpH: 7.5 T: 2°C. Assay description: The compounds of the invention are assessed for the ability to interact with human LTA4 hydrolase in an enzymatic assay that measures the ability of ...
Ligand InfoPC cidPC sid
In DepthDetails US Patent