BDBM290018 2-Propoxy-1-(4-{6-[5-(2H-pyrazol- 3-yl)-pyridin-2-yloxy]-quinolin-2- ylmethyl}-piperazin-1-yl)-ethanone::US9573957, Example 144
SMILES CCCOCC(=O)N1CCN(Cc2ccc3cc(Oc4ccc(cn4)-c4ccn[nH]4)ccc3n2)CC1
InChI Key InChIKey=DYYLKAHJUXZGCY-UHFFFAOYSA-N
Data  1 IC50
  Tab Delimited (TSV)   2D SDfile   Computed 3D by Vconf -m prep SDfile
Find this compound or compounds like it in BindingDB:
Activity Spreadsheet -- Enzyme Inhibition Constant Data from BindingDB
Found 1 hit for monomerid = 290018
TargetLeukotriene A-4 hydrolase(Homo sapiens (Human))
Boehringer Ingelheim International
US Patent
LigandPNGBDBM290018(2-Propoxy-1-(4-{6-[5-(2H-pyrazol- 3-yl)-pyridin-2-...)
Affinity DataIC50:  2.30nMpH: 7.5 T: 2°C. Assay description: The compounds of the invention are assessed for the ability to interact with human LTA4 hydrolase in an enzymatic assay that measures the ability of ...
Ligand InfoPC cidPC sid
In DepthDetails US Patent