BDBM290153 US9573958, Compound 3
SMILES Clc1ccc(cc1)C(=O)N=c1[nH]c2ccccc2n1C1CCCN(C1)C(=O)C=C
InChI Key
Data  1 IC50
  Tab Delimited (TSV)   2D SDfile   Computed 3D by Vconf -m prep SDfile
Find this compound or compounds like it in BindingDB:
Activity Spreadsheet -- Enzyme Inhibition Constant Data from BindingDB
Found 1 hit for monomerid = 290153
TargetTyrosine-protein kinase ITK/TSK(Homo sapiens (Human))
Principia Biopharma
US Patent
LigandPNGBDBM290153(US9573958, Compound 3)
Affinity DataIC50:  530nMpH: 7.5Assay Description:The ability of the compounds of the present disclosure to inhibit ITK was measured using the Caliper assay format, which is an electrophoretic separa...
Ligand InfoPC cidPC sid
In DepthDetails US Patent