BDBM290180 US9572811, Example 75B
SMILES CC(C)C=C(C#N)C(=O)N1CCC[C@H]1Cn1nc(-c2ccc(Oc3c(F)cccc3F)cc2)c2c(N)ncnc12
InChI Key InChIKey=CSUHSJHWBUGLCV-ACSPXDACSA-N
Data  1 IC50
  Tab Delimited (TSV)   2D SDfile   Computed 3D by Vconf -m prep SDfile
Find this compound or compounds like it in BindingDB:
Activity Spreadsheet -- Enzyme Inhibition Constant Data from BindingDB
Found 1 hit for monomerid = 290180
TargetTyrosine-protein kinase BTK(Homo sapiens (Human))
Principia Biopharma
US Patent
LigandPNGBDBM290180(US9572811, Example 75B)
Affinity DataIC50:  100nMT: 2°C. Assay description: A Caliper-based kinase assay (Caliper Life Sciences, Hopkinton, Mass.) was used to measure inhibition of Btk kinase activity of a compound of Formula...
Ligand InfoPC cidPC sid
In DepthDetails US Patent