BDBM290242 US9573958, Compound 134
SMILES CC(C)C=C(C#N)C(=O)N1CCC[C@@H]1Cn1c(NC(=O)c2ccno2)nc2cc(CNCC(C)(C)C)ccc12
InChI Key InChIKey=ZPMXHBLIXDCJKL-MUIAGPEESA-N
Data  1 IC50
  Tab Delimited (TSV)   2D SDfile   Computed 3D by Vconf -m prep SDfile
Find this compound or compounds like it in BindingDB:
Activity Spreadsheet -- Enzyme Inhibition Constant Data from BindingDB
Found 1 hit for monomerid = 290242
TargetTyrosine-protein kinase ITK/TSK(Homo sapiens (Human))
Principia Biopharma
US Patent
LigandPNGBDBM290242(US9573958, Compound 134)
Affinity DataIC50:  2.60nMpH: 7.5Assay Description:The ability of the compounds of the present disclosure to inhibit ITK was measured using the Caliper assay format, which is an electrophoretic separa...
Ligand InfoPC cidPC sid
In DepthDetails US Patent