BDBM29046 cambinol analog, 6ii
SMILES Cc1cccc(c1)-c1[nH]c(=S)[nH]c(=O)c1Cc1c(O)ccc2ccccc12
InChI Key InChIKey=YUOHPNUKFFOPOO-UHFFFAOYSA-N
Data  1 IC50
  Tab Delimited (TSV)   2D SDfile   Computed 3D by Vconf -m prep SDfile
Find this compound or compounds like it in BindingDB:
Activity Spreadsheet -- Enzyme Inhibition Constant Data from BindingDB
Found 2 hits for monomerid = 29046
TargetNAD-dependent protein deacetylase sirtuin-2(Homo sapiens (Human))
University Of St. Andrews
LigandPNGBDBM29046(cambinol analog, 6ii)
Affinity Data. Assay description: Compounds were tested for inhibition of sirtuin (SIRT1 or SIRT2) using the human recombinant enzyme provided with the Fluor de Lys fluorescence-based...
In DepthDetails ArticlePubMed
TargetNAD-dependent protein deacetylase sirtuin-1(Homo sapiens (Human))
University Of St. Andrews
LigandPNGBDBM29046(cambinol analog, 6ii)
Affinity DataIC50:  4.42E+4nMpH: 8.0 T: 2°C. Assay description: Compounds were tested for inhibition of sirtuin (SIRT1 or SIRT2) using the human recombinant enzyme provided with the Fluor de Lys fluorescence-based...
In DepthDetails ArticlePubMed