BDBM290809 2-((1R,2S)-2-aminocyclohexylamino)-4-(6-methoxynaphthalen-2-ylamino)pyrimidine-5-carboxamide::US9579320, Example 210
SMILES COc1ccc2cc(Nc3nc(N[C@@H]4CCCC[C@@H]4N)ncc3C(N)=O)ccc2c1
InChI Key InChIKey=YTJKBYITDSFHIG-RBUKOAKNSA-N
Data  1 IC50
  Tab Delimited (TSV)   2D SDfile   Computed 3D by Vconf -m prep SDfile
Find this compound or compounds like it in BindingDB:
Activity Spreadsheet -- Enzyme Inhibition Constant Data from BindingDB
Found 1 hit for monomerid = 290809
TargetTyrosine-protein kinase SYK(Homo sapiens (Human))
Portola Pharmaceuticals
US Patent
LigandPNGBDBM290809(2-((1R,2S)-2-aminocyclohexylamino)-4-(6-methoxynap...)
Affinity DataIC50:  5.5nMpH: 7.5 T: 2°C. Assay description: Potency of candidate molecules for inhibiting syk tyrosine phosphorylation activity is assessed by measuring the ability of a test compound to inhibi...
Ligand InfoPC cidPC sid
In DepthDetails US Patent