BDBM291153 US9580396, Example 5p
SMILES COc1cnc(C(=O)Nc2ccc3CCC[C@]4(CS(=O)(=O)N(C)C(=N)N4)c3c2)c(C)n1
InChI Key InChIKey=MBASXXHLOWSIKM-FQEVSTJZSA-N
Data  2 KI
  Tab Delimited (TSV)   2D SDfile   Computed 3D by Vconf -m prep SDfile
Find this compound or compounds like it in BindingDB:
Activity Spreadsheet -- Enzyme Inhibition Constant Data from BindingDB
Found 2 hits for monomerid = 291153
TargetBeta-secretase 2(Homo sapiens (Human))
Merck Sharp & Dohme
US Patent
LigandPNGBDBM291153(US9580396, Example 5p)
Affinity DataKi:  123nMpH: 5.0Assay Description:Inhibitor IC50s at purified human autoBACE-2 are determined in a time-resolved endpoint proteolysis assay that measures hydrolysis of the QSY7-EISEVN...
Ligand InfoPC cidPC sid
In DepthDetails US Patent
TargetBeta-secretase 1(Homo sapiens (Human))
Merck Sharp & Dohme
US Patent
LigandPNGBDBM291153(US9580396, Example 5p)
Affinity DataKi:  224nMpH: 5.0Assay Description:A homogeneous time-resolved FRET assay can be used to determine IC50 values for inhibitors of the soluble human BACE1 catalytic domain. This assay mo...
Ligand InfoPC cidPC sid
In DepthDetails US Patent