BDBM291191 N-{4-[(3R,4R,5S)-3-Amino-4-hydroxy-5-methylpiperidin-1-yl]pyridin-3-yl}-7-morpholin-4-ylquinoline-2-carboxamide::US9580418, Example 12::US9890162, Example 12
SMILES C[C@H]1CN(C[C@@H](N)[C@@H]1O)c1ccncc1NC(=O)c1ccc2ccc(cc2n1)N1CCOCC1
InChI Key InChIKey=IVDHHSHASJYFNA-LSRZYVKLSA-N
Data  6 IC50
  Tab Delimited (TSV)   2D SDfile   Computed 3D by Vconf -m prep SDfile
Find this compound or compounds like it in BindingDB:
Activity Spreadsheet -- Enzyme Inhibition Constant Data from BindingDB
Found 6 hits for monomerid = 291191
TargetSerine/threonine-protein kinase pim-1(Homo sapiens (Human))
Incyte
US Patent
LigandPNGBDBM291191(N-{4-[(3R,4R,5S)-3-Amino-4-hydroxy-5-methylpiperid...)
Affinity DataIC50: <10nMpH: 7.5 T: 2°C. Assay description: Pim-1 and Pim-3 kinase assays-20 μL reactions were run in white 384 well polystyrene plates dotted with 0.8 μL compound/DMSO in the assay b...
Ligand InfoPC cidPC sid
In DepthDetails US Patent
TargetSerine/threonine-protein kinase pim-2(Homo sapiens (Human))
Incyte
US Patent
LigandPNGBDBM291191(N-{4-[(3R,4R,5S)-3-Amino-4-hydroxy-5-methylpiperid...)
Affinity DataIC50: <100nMpH: 7.5 T: 2°C. Assay description: Pim-1 and Pim-3 kinase assays-20 μL reactions were run in white 384 well polystyrene plates dotted with 0.8 μL compound/DMSO in the assay b...
Ligand InfoPC cidPC sid
In DepthDetails US Patent
TargetSerine/threonine-protein kinase pim-3(Homo sapiens (Human))
Incyte
US Patent
LigandPNGBDBM291191(N-{4-[(3R,4R,5S)-3-Amino-4-hydroxy-5-methylpiperid...)
Affinity DataIC50: <10nM. Assay description: Pim-1 and Pim-3 kinase assays-20 uL reactions were run in white 384 well polystyrene plates dotted with 0.8 uL compound/DMSO in the assay buffer (50 ...
Ligand InfoPC cidPC sid
In DepthDetails US Patent
TargetSerine/threonine-protein kinase pim-1(Homo sapiens (Human))
Incyte
US Patent
LigandPNGBDBM291191(N-{4-[(3R,4R,5S)-3-Amino-4-hydroxy-5-methylpiperid...)
Affinity DataIC50: <10nM. Assay description: Pim-1 and Pim-3 kinase assays-20 uL reactions were run in white 384 well polystyrene plates dotted with 0.8 uL compound/DMSO in the assay buffer (50 ...
Ligand InfoPC cidPC sid
In DepthDetails US Patent
TargetSerine/threonine-protein kinase pim-2(Homo sapiens (Human))
Incyte
US Patent
LigandPNGBDBM291191(N-{4-[(3R,4R,5S)-3-Amino-4-hydroxy-5-methylpiperid...)
Affinity DataIC50: <100nM. Assay description: Pim-1 and Pim-3 kinase assays-20 uL reactions were run in white 384 well polystyrene plates dotted with 0.8 uL compound/DMSO in the assay buffer (50 ...
Ligand InfoPC cidPC sid
In DepthDetails US Patent
TargetSerine/threonine-protein kinase pim-3(Homo sapiens (Human))
Incyte
US Patent
LigandPNGBDBM291191(N-{4-[(3R,4R,5S)-3-Amino-4-hydroxy-5-methylpiperid...)
Affinity DataIC50: <10nMpH: 7.5 T: 2°C. Assay description: Pim-1 and Pim-3 kinase assays-20 μL reactions were run in white 384 well polystyrene plates dotted with 0.8 μL compound/DMSO in the assay b...
Ligand InfoPC cidPC sid
In DepthDetails US Patent