BDBM291287 US9580432, Example 18
SMILES CC(C)N(C)C\C=C\C(=O)N1CCC[C@H](C1)n1nc(C(=O)Nc2nc3cc(Cl)ccc3o2)c2c(N)ncnc12
InChI Key InChIKey=ONUKEVKZBUDRTK-QQOXCAACSA-N
Data  2 IC50
  Tab Delimited (TSV)   2D SDfile   Computed 3D by Vconf -m prep SDfile
Find this compound or compounds like it in BindingDB:
Activity Spreadsheet -- Enzyme Inhibition Constant Data from BindingDB
Found 2 hits for monomerid = 291287
TargetEpidermal growth factor receptor(Homo sapiens (Human))
Taiho Pharmaceutical
US Patent
LigandPNGBDBM291287(US9580432, Example 18)
Affinity DataIC50:  121nMpH: 7.5 T: 2°C. Assay description: With regard to the setting of the conditions for a method for measuring the inhibitory activity of a compound against EGFR kinase activity in vitro, ...
Ligand InfoPC cidPC sid
In DepthDetails US Patent
TargetTyrosine-protein kinase BTK(Homo sapiens (Human))
Taiho Pharmaceutical
US Patent
LigandPNGBDBM291287(US9580432, Example 18)
Affinity DataIC50:  0.788nMpH: 7.5Assay Description:With regard to the setting of the conditions for a method for measuring the inhibitory activity of a compound against BTK kinase activity in vitro, i...
Ligand InfoPC cidPC sid
In DepthDetails US Patent