BDBM291332 US9580432, Example P-2
SMILES Nc1ncnc2n(nc(C(=O)Nc3nc4ccccc4o3)c12)[C@@H]1CCCN(C1)C(=O)\C=C\CN1CCN(CCNC(=O)CCCC[C@@H]2SC[C@@H]3NC(=O)N[C@H]23)CC1
InChI Key InChIKey=VDCSORUOEGTUPX-AMRHPPHNSA-N
Data  1 IC50
  Tab Delimited (TSV)   2D SDfile   Computed 3D by Vconf -m prep SDfile
Find this compound or compounds like it in BindingDB:
Activity Spreadsheet -- Enzyme Inhibition Constant Data from BindingDB
Found 1 hit for monomerid = 291332
TargetTyrosine-protein kinase BTK(Homo sapiens (Human))
Taiho Pharmaceutical
US Patent
LigandPNGBDBM291332(US9580432, Example P-2)
Affinity DataIC50:  43.9nMpH: 7.5Assay Description:With regard to the setting of the conditions for a method for measuring the inhibitory activity of a compound against BTK kinase activity in vitro, i...
Ligand InfoPC cidPC sid
In DepthDetails US Patent