BDBM29134 substituted chalcone, 5m
SMILES Oc1ccc(C(=O)\C=C\c2ccc(Cl)cc2)c(O)c1
InChI Key InChIKey=AQASVHPTJNWRJB-FPYGCLRLSA-N
Data  5 IC50
  Tab Delimited (TSV)   2D SDfile   Computed 3D by Vconf -m prep SDfile
Find this compound or compounds like it in BindingDB:
Activity Spreadsheet -- Enzyme Inhibition Constant Data from BindingDB
Found 5 hits for monomerid = 29134
TargetAmine oxidase [flavin-containing] A(Homo sapiens (Human))
Sapienza University Of Rome
LigandPNGBDBM29134(substituted chalcone, 5m)
Affinity DataIC50:  4.95E+3nMpH: 7.4 T: 2°C. Assay description: The effects of the test compounds on hMAO isoform enzymatic activity were evaluated by measuring their effects on the production of hydrogen peroxide...
In DepthDetails ArticlePubMed
TargetAmine oxidase [flavin-containing] B(Homo sapiens (Human))
Sapienza University Of Rome
LigandPNGBDBM29134(substituted chalcone, 5m)
Affinity DataIC50:  5.10nMpH: 7.4 T: 2°C. Assay description: The effects of the test compounds on hMAO isoform enzymatic activity were evaluated by measuring their effects on the production of hydrogen peroxide...
In DepthDetails ArticlePubMed
TargetAmine oxidase [flavin-containing] B(Homo sapiens (Human))
Sapienza University Of Rome
LigandPNGBDBM29134(substituted chalcone, 5m)
Affinity DataIC50:  5.13E+3nM. Assay description: Inhibition of MAO-B (unknown origin)
In DepthDetails ArticlePubMed
TargetBroad substrate specificity ATP-binding cassette transporter ABCG2(Homo sapiens (Human))
University Of Bonn
Curated by ChEMBL
LigandPNGBDBM29134(substituted chalcone, 5m)
Affinity DataIC50:  6.07E+3nM. Assay description: Inhibition of BCRP in human MCF7/MX cells assessed as Hoechst 33342 accumulation preincubated for 30 mins by Fluorometry
In DepthDetails ArticlePubMed
TargetBroad substrate specificity ATP-binding cassette transporter ABCG2(Homo sapiens (Human))
University Of Bonn
Curated by ChEMBL
LigandPNGBDBM29134(substituted chalcone, 5m)
Affinity DataIC50:  6.37E+3nM. Assay description: Inhibition of human BCRP expressed in MDCK2 cells assessed as Hoechst 33342 accumulation preincubated for 30 mins by fluorimetry
In DepthDetails ArticlePubMed