BDBM291359 (E)-3-[2-(1H-Indol-4-yl)-4-morpholin-4-yl-pyrido[3′,2′:4,5]furo[3,2-d]pyrimidin-8-yl]-N,N-dimethylacrylamide::US9580442, Example G::US9938290, G
SMILES CN(C)C(=O)\C=C\c1cnc2oc3c(nc(nc3c2c1)-c1cccc2[nH]ccc12)N1CCOCC1
InChI Key InChIKey=MMCLGQOGMBMOJC-VOTSOKGWSA-N
Data  8 IC50
  Tab Delimited (TSV)   2D SDfile   Computed 3D by Vconf -m prep SDfile
Find this compound or compounds like it in BindingDB:
Activity Spreadsheet -- Enzyme Inhibition Constant Data from BindingDB
Found 8 hits for monomerid = 291359
TargetPhosphatidylinositol 4,5-bisphosphate 3-kinase catalytic subunit alpha isoform(Homo sapiens (Human))
Karus Therapeutics
US Patent
LigandPNGBDBM291359((E)-3-[2-(1H-Indol-4-yl)-4-morpholin-4-yl-pyrido[3...)
Affinity DataIC50:  223nM. Assay description: PI3K Isoform using biochemical assay.
Ligand InfoPC cidPC sid
In DepthDetails US Patent
TargetPhosphatidylinositol 4,5-bisphosphate 3-kinase catalytic subunit beta isoform(Homo sapiens (Human))
Karus Therapeutics
US Patent
LigandPNGBDBM291359((E)-3-[2-(1H-Indol-4-yl)-4-morpholin-4-yl-pyrido[3...)
Affinity DataIC50:  83nM. Assay description: PI3K Isoform using biochemical assay.
Ligand InfoPC cidPC sid
In DepthDetails US Patent
TargetPhosphatidylinositol 4,5-bisphosphate 3-kinase catalytic subunit delta isoform(Homo sapiens (Human))
Karus Therapeutics
US Patent
LigandPNGBDBM291359((E)-3-[2-(1H-Indol-4-yl)-4-morpholin-4-yl-pyrido[3...)
Affinity DataIC50:  5nM. Assay description: PI3K Isoform using biochemical assay.
Ligand InfoPC cidPC sid
In DepthDetails US Patent
TargetPhosphatidylinositol 4,5-bisphosphate 3-kinase catalytic subunit gamma isoform(Homo sapiens (Human))
Karus Therapeutics
US Patent
LigandPNGBDBM291359((E)-3-[2-(1H-Indol-4-yl)-4-morpholin-4-yl-pyrido[3...)
Affinity DataIC50:  1.66E+3nM. Assay description: Please see article
Ligand InfoPC cidPC sid
In DepthDetails US Patent
TargetPhosphatidylinositol 4,5-bisphosphate 3-kinase catalytic subunit alpha isoform(Homo sapiens (Human))
Karus Therapeutics
US Patent
LigandPNGBDBM291359((E)-3-[2-(1H-Indol-4-yl)-4-morpholin-4-yl-pyrido[3...)
Affinity DataIC50:  223nM. Assay description: Please see article
Ligand InfoPC cidPC sid
In DepthDetails US Patent
TargetPhosphatidylinositol 4,5-bisphosphate 3-kinase catalytic subunit beta isoform(Homo sapiens (Human))
Karus Therapeutics
US Patent
LigandPNGBDBM291359((E)-3-[2-(1H-Indol-4-yl)-4-morpholin-4-yl-pyrido[3...)
Affinity DataIC50:  83nM. Assay description: Please see article
Ligand InfoPC cidPC sid
In DepthDetails US Patent
TargetPhosphatidylinositol 4,5-bisphosphate 3-kinase catalytic subunit delta isoform(Homo sapiens (Human))
Karus Therapeutics
US Patent
LigandPNGBDBM291359((E)-3-[2-(1H-Indol-4-yl)-4-morpholin-4-yl-pyrido[3...)
Affinity DataIC50:  5nM. Assay description: Please see article
Ligand InfoPC cidPC sid
In DepthDetails US Patent
TargetPhosphatidylinositol 4,5-bisphosphate 3-kinase catalytic subunit gamma isoform(Homo sapiens (Human))
Karus Therapeutics
US Patent
LigandPNGBDBM291359((E)-3-[2-(1H-Indol-4-yl)-4-morpholin-4-yl-pyrido[3...)
Affinity DataIC50:  1.66E+3nM. Assay description: PI3K Isoform using biochemical assay.
Ligand InfoPC cidPC sid
In DepthDetails US Patent