BDBM291514 N-(3-(2-amino-4-(4-phenoxyphenoxy)pyridin-3-yl)phenyl)acrylamide ::US10413562, Compound A243::US9580449, Example A243
SMILES Nc1nccc(Oc2ccc(Oc3ccccc3)cc2)c1-c1cccc(NC(=O)C=C)c1
InChI Key InChIKey=YNSGTOFAJALBRZ-UHFFFAOYSA-N
Data  2 IC50
  Tab Delimited (TSV)   2D SDfile   Computed 3D by Vconf -m prep SDfile
Find this compound or compounds like it in BindingDB:
Activity Spreadsheet -- Enzyme Inhibition Constant Data from BindingDB
Found 2 hits for monomerid = 291514
TargetTyrosine-protein kinase BTK(Homo sapiens (Human))
Merck Patent
US Patent
LigandPNGBDBM291514(N-(3-(2-amino-4-(4-phenoxyphenoxy)pyridin-3-yl)phe...)
Affinity DataIC50: <100nM. Assay description: 2.5× stocks of full-length human BTK (08-080) from CarnaBio USA, Inc., Natick, Mass., 1.6×ATP and appropriate kinKDR peptide substrate (FITC-AHA-EEPL...
Ligand InfoPC cidPC sid
In DepthDetails US Patent
TargetTyrosine-protein kinase BTK(Homo sapiens (Human))
Merck Patent
US Patent
LigandPNGBDBM291514(N-(3-(2-amino-4-(4-phenoxyphenoxy)pyridin-3-yl)phe...)
Affinity DataIC50: <100nMpH: 7.5 T: 2°C. Assay description: The following describes a microfluidic, off-chip mobility shift kinase assay used to measure inherent potency of compounds against BTK enzyme. Compou...
Ligand InfoPC cidPC sid
In DepthDetails US Patent