BDBM291548 (E)-N-(3-(4-amino-6-(4-phenoxyphenoxy)pyrimidin-5-yl)phenyl)-4-morpholinobut-2-enamide ::US9580449, Example A274
SMILES Nc1ncnc(Oc2ccc(Oc3ccccc3)cc2)c1-c1cccc(NC(=O)\C=C\CN2CCOCC2)c1
InChI Key InChIKey=ZQCCGOOHVUHXQW-BJMVGYQFSA-N
Data  1 IC50
  Tab Delimited (TSV)   2D SDfile   Computed 3D by Vconf -m prep SDfile
Find this compound or compounds like it in BindingDB:
Activity Spreadsheet -- Enzyme Inhibition Constant Data from BindingDB
Found 1 hit for monomerid = 291548
TargetTyrosine-protein kinase BTK(Homo sapiens (Human))
Merck Patent
US Patent
LigandPNGBDBM291548((E)-N-(3-(4-amino-6-(4-phenoxyphenoxy)pyrimidin-5-...)
Affinity DataIC50: <100nMpH: 7.5 T: 2°C. Assay description: The following describes a microfluidic, off-chip mobility shift kinase assay used to measure inherent potency of compounds against BTK enzyme. Compou...
Ligand InfoPC cidPC sid
In DepthDetails US Patent