BDBM29156 3-carboxamido coumarin, 5
SMILES NCCNC(=O)c1cc2ccccc2oc1=O
InChI Key InChIKey=ZZZHRZHNTZJEMF-UHFFFAOYSA-N
Data  1 IC50  1 Other
  Tab Delimited (TSV)   2D SDfile   Computed 3D by Vconf -m prep SDfile
Find this compound or compounds like it in BindingDB:
Activity Spreadsheet -- Enzyme Inhibition Constant Data from BindingDB
Found 2 hits for monomerid = 29156
TargetAmine oxidase [flavin-containing] B(Homo sapiens (Human))
Sapienza University Of Rome
LigandPNGBDBM29156(3-carboxamido coumarin, 5)
Affinity DataIC50:  7.68E+3nM. Assay description: The effects of the test compounds on hMAO isoform enzymatic activity were evaluated by measuring their effects on the production of hydrogen peroxide...
In DepthDetails ArticlePubMed
TargetAmine oxidase [flavin-containing] A(Homo sapiens (Human))
Sapienza University Of Rome
LigandPNGBDBM29156(3-carboxamido coumarin, 5)
Affinity DatapH: 7.4 T: 2°C. Assay description: The effects of the test compounds on hMAO isoform enzymatic activity were evaluated by measuring their effects on the production of hydrogen peroxide...
In DepthDetails ArticlePubMed