BDBM291612 (R)-1-(3-((6-amino-5-(4-phenoxyphenyl)pyrimidin-4-yl)amino)pyrrolidin-1-yl)but-2-yn-1-one ::US10413562, Compound A341::US9580449, Example A341
SMILES CC#CC(=O)N1CC[C@H](C1)Nc1ncnc(N)c1-c1ccc(Oc2ccccc2)cc1
InChI Key InChIKey=PEJUAAXUACXHNW-GOSISDBHSA-N
Data  2 IC50
  Tab Delimited (TSV)   2D SDfile   Computed 3D by Vconf -m prep SDfile
Find this compound or compounds like it in BindingDB:
Activity Spreadsheet -- Enzyme Inhibition Constant Data from BindingDB
Found 2 hits for monomerid = 291612
TargetTyrosine-protein kinase BTK(Homo sapiens (Human))
Merck Patent
US Patent
LigandPNGBDBM291612((R)-1-(3-((6-amino-5-(4-phenoxyphenyl)pyrimidin-4-...)
Affinity DataIC50: <100nM. Assay description: 2.5× stocks of full-length human BTK (08-080) from CarnaBio USA, Inc., Natick, Mass., 1.6×ATP and appropriate kinKDR peptide substrate (FITC-AHA-EEPL...
Ligand InfoPC cidPC sid
In DepthDetails US Patent
TargetTyrosine-protein kinase BTK(Homo sapiens (Human))
Merck Patent
US Patent
LigandPNGBDBM291612((R)-1-(3-((6-amino-5-(4-phenoxyphenyl)pyrimidin-4-...)
Affinity DataIC50: <100nMpH: 7.5 T: 2°C. Assay description: The following describes a microfluidic, off-chip mobility shift kinase assay used to measure inherent potency of compounds against BTK enzyme. Compou...
Ligand InfoPC cidPC sid
In DepthDetails US Patent