BDBM29162 3-carboxamido coumarin, 12
SMILES Cc1ccc(NC(=O)c2cc3ccccc3oc2=O)cc1
InChI Key InChIKey=RYYPYTSGWXNKDU-UHFFFAOYSA-N
Data  2 IC50
  Tab Delimited (TSV)   2D SDfile   Computed 3D by Vconf -m prep SDfile
Find this compound or compounds like it in BindingDB:
Activity Spreadsheet -- Enzyme Inhibition Constant Data from BindingDB
Found 2 hits for monomerid = 29162
TargetAmine oxidase [flavin-containing] B(Homo sapiens (Human))
Sapienza University Of Rome
LigandPNGBDBM29162(3-carboxamido coumarin, 12)
Affinity DataIC50:  710nM. Assay description: The effects of the test compounds on hMAO isoform enzymatic activity were evaluated by measuring their effects on the production of hydrogen peroxide...
In DepthDetails ArticlePubMed
TargetAmine oxidase [flavin-containing] A(Homo sapiens (Human))
Sapienza University Of Rome
LigandPNGBDBM29162(3-carboxamido coumarin, 12)
Affinity DataIC50:  1.95E+4nMpH: 7.4 T: 2°C. Assay description: The effects of the test compounds on hMAO isoform enzymatic activity were evaluated by measuring their effects on the production of hydrogen peroxide...
In DepthDetails ArticlePubMed