BDBM29172 3-carboxamido coumarin, 22
SMILES Oc1ccc(NC(=O)c2cc3ccccc3oc2=O)cc1
InChI Key InChIKey=NUJGUJHBLMSFBE-UHFFFAOYSA-N
Data  1 IC50  1 Other
  Tab Delimited (TSV)   2D SDfile   Computed 3D by Vconf -m prep SDfile
Find this compound or compounds like it in BindingDB:
Activity Spreadsheet -- Enzyme Inhibition Constant Data from BindingDB
Found 2 hits for monomerid = 29172
TargetAmine oxidase [flavin-containing] B(Human)
Sapienza University of Rome
LigandPNGBDBM29172(3-carboxamido coumarin, 22)
Affinity DataIC50:  800nM. Assay description: The effects of the test compounds on hMAO isoform enzymatic activity were evaluated by measuring their effects on the production of hydrogen peroxide...
In DepthDetails ArticlePubMed
TargetAmine oxidase [flavin-containing] A(Human)
Sapienza University of Rome
LigandPNGBDBM29172(3-carboxamido coumarin, 22)
Affinity DatapH: 7.4 T: 37°C. Assay description: The effects of the test compounds on hMAO isoform enzymatic activity were evaluated by measuring their effects on the production of hydrogen peroxide...
In DepthDetails ArticlePubMed