BDBM291963 US10100019, Example 33
SMILES COc1ccc(CCN)cc1Nc1ncc(Cl)c(Nc2cc(F)ccc2S(=O)(=O)C(C)C)n1
InChI Key InChIKey=ZVKDNTYDSLTOPM-UHFFFAOYSA-N
Data  1 IC50
  Tab Delimited (TSV)   2D SDfile   Computed 3D by Vconf -m prep SDfile
Find this compound or compounds like it in BindingDB:
Activity Spreadsheet -- Enzyme Inhibition Constant Data from BindingDB
Found 1 hit for monomerid = 291963
TargetALK tyrosine kinase receptor(Homo sapiens (Human))
Korea Research Institute Of Chemical Technology
US Patent
LigandPNGBDBM291963(US10100019, Example 33)
Affinity DataIC50:  420nMT: 2°C. Assay description: The following experiment was performed in order to measure the activity of the N2-(2-methoxyphenyl)pyrimidine derivative represented by formula 1 of ...
Ligand InfoPC cidPC sid
In DepthDetails US Patent