BDBM291992 US10100019, Example 62
SMILES COc1cc(CCNC=O)c(C)cc1Nc1ncc(Cl)c(Nc2ccccc2S(=O)(=O)C(C)C)n1
InChI Key InChIKey=WXMYXQYBHNGGNH-UHFFFAOYSA-N
Data  4 IC50
  Tab Delimited (TSV)   2D SDfile   Computed 3D by Vconf -m prep SDfile
Find this compound or compounds like it in BindingDB:
Activity Spreadsheet -- Enzyme Inhibition Constant Data from BindingDB
Found 4 hits for monomerid = 291992
TargetALK tyrosine kinase receptor(Homo sapiens (Human))
Korea Research Institute Of Chemical Technology
US Patent
LigandPNGBDBM291992(US10100019, Example 62)
Affinity DataIC50:  4nMT: 2°C. Assay description: The following experiment was performed in order to measure the activity of the N2-(2-methoxyphenyl)pyrimidine derivative represented by formula 1 of ...
Ligand InfoKEGGPC cidPC sid
In DepthDetails US Patent
TargetALK tyrosine kinase receptor(Homo sapiens (Human))
Korea Research Institute Of Chemical Technology
US Patent
LigandPNGBDBM291992(US10100019, Example 62)
Affinity DataIC50:  4nM. Assay description: Inhibition of wild-type ALK (unknown origin) using peptide as substrate measured after 30 mins by fluorescence assay
Ligand InfoKEGGPC cidPC sid
In DepthDetails ArticlePubMed
TargetInsulin receptor(Homo sapiens (Human))
Korea Research Institute Of Chemical Technology
US Patent
LigandPNGBDBM291992(US10100019, Example 62)
Affinity DataIC50:  17nM. Assay description: To measure the activity of the N2-(2-methoxyphenyl)pyrimidine derivative represented by formula 1 of the present invention to inhibit anaplastic lymp...
Ligand InfoKEGGPC cidPC sid
In DepthDetails US Patent
TargetALK tyrosine kinase receptor [L1196M](Homo sapiens (Human))
Korea Research Institute Of Chemical Technology
US Patent
LigandPNGBDBM291992(US10100019, Example 62)
Affinity DataIC50:  4.40nM. Assay description: To measure the activity of the N2-(2-methoxyphenyl)pyrimidine derivative represented by formula 1 of the present invention to inhibit anaplastic lymp...
Ligand InfoKEGGPC cidPC sid
In DepthDetails US Patent