BDBM29228 casimiroin analogue, 1q
SMILES COc1c(OC)c(OC)c2c(C)cc(=O)[nH]c2c1OC
InChI Key InChIKey=UWSNOYGRNSLKPY-UHFFFAOYSA-N
Data  2 IC50
  Tab Delimited (TSV)   2D SDfile   Computed 3D by Vconf -m prep SDfile
Find this compound or compounds like it in BindingDB:
Activity Spreadsheet -- Enzyme Inhibition Constant Data from BindingDB
Found 2 hits for monomerid = 29228
TargetAromatase(Homo sapiens (Human))
Purdue University
LigandPNGBDBM29228(casimiroin analogue, 1q)
Affinity DataIC50:  5.68E+3nM. Assay description: Aromatase inhibition was quantified by measuring the fluorescent intensity of fluorescein, the hydrolysis product of dibenzylfluorescein (DBF), by ar...
In DepthDetails ArticlePubMed
TargetRibosyldihydronicotinamide dehydrogenase [quinone](Homo sapiens (Human))
Purdue University
LigandPNGBDBM29228(casimiroin analogue, 1q)
Affinity DataIC50: >5.00E+5nMpH: 7.5 T: 2°C. Assay description: The activity of QR2 under steady-state conditions was evaluated on SpectraMax Plus 384 UV/vis spectrophotometer by monitoring the increase in absorba...
In DepthDetails ArticlePubMed