BDBM292497 (S)-N-(2-(diethylamino)propyl)-2-(3-fluoroazetidin-1-yl)-6-(5-(thiophen-2-yl)pyrazolo[1,5-a]pyrimidin-3-yl)isonicotinamide::US10100058, Example 153
SMILES CCN(CC)[C@@H](C)CNC(=O)c1cc(nc(c1)-c1cnn2ccc(nc12)-c1cccs1)N1CC(F)C1
InChI Key InChIKey=JMBAXWLHLKJCLO-KRWDZBQOSA-N
Data  1 IC50  1 EC50
  Tab Delimited (TSV)   2D SDfile   Computed 3D by Vconf -m prep SDfile
Find this compound or compounds like it in BindingDB:
Activity Spreadsheet -- Enzyme Inhibition Constant Data from BindingDB
Found 2 hits for monomerid = 292497
TargetCalcium/calmodulin-dependent protein kinase type II subunit delta(Homo sapiens (Human))
Gilead Sciences
US Patent
LigandPNGBDBM292497((S)-N-(2-(diethylamino)propyl)-2-(3-fluoroazetidin...)
Affinity DataEC50:  20.5nM. Assay description: CaMKII activity in neonatal rat ventricular myocytes (NRVM) was measured by monitoring the phosphorylation level of phospholamban using high-content ...
Ligand InfoPC cidPC sid
In DepthDetails US Patent
TargetCalcium/calmodulin-dependent protein kinase type II subunit delta(Homo sapiens (Human))
Gilead Sciences
US Patent
LigandPNGBDBM292497((S)-N-(2-(diethylamino)propyl)-2-(3-fluoroazetidin...)
Affinity DataIC50:  0.130nM. Assay description: The biochemical activity of recombinant CaMKIIδ was measured by monitoring the phosphorylation of a target peptide using Homogenous Time Resolve...
Ligand InfoPC cidPC sid
In DepthDetails US Patent