BDBM292821 US10106501, Example F1-3
SMILES C[C@H]1CN(CC[C@H]1C(O)=O)C(=O)c1ccc(Cl)c(Cc2cn(C)c3cc(cc(C)c23)C(F)(F)F)c1Cl
InChI Key InChIKey=AVEZWISTIIOEEB-WMLDXEAASA-N
Data  1 IC50
  Tab Delimited (TSV)   2D SDfile   Computed 3D by Vconf -m prep SDfile
Find this compound or compounds like it in BindingDB:
Activity Spreadsheet -- Enzyme Inhibition Constant Data from BindingDB
Found 1 hit for monomerid = 292821
TargetNuclear receptor ROR-gamma(Homo sapiens (Human))
Abbvie
US Patent
LigandPNGBDBM292821(US10106501, Example F1-3)
Affinity DataIC50: <100nM. Assay description: The primary screen was performed by transient transactivation assays. These cell-based assays were carried out using Cos-7 cells transfected with a c...
Ligand InfoPC cidPC sid
In DepthDetails US Patent