BDBM29296 triazole, 3n
SMILES COc1ccccc1-n1c(Sc2ncc(s2)[N+]([O-])=O)n[nH]c1=O
InChI Key InChIKey=WPXBDBHYTQROJA-UHFFFAOYSA-N
Data  2 IC50
  Tab Delimited (TSV)   2D SDfile   Computed 3D by Vconf -m prep SDfile
Find this compound or compounds like it in BindingDB:
Activity Spreadsheet -- Enzyme Inhibition Constant Data from BindingDB
Found 2 hits for monomerid = 29296
TargetMitogen-activated protein kinase 8(Homo sapiens (Human))
Burnham Institute For Medical Research
LigandPNGBDBM29296(triazole, 3n)
Affinity DataIC50:  2.20E+3nM. Assay description: Compounds were tested for their ability to inhibit JNK1 phosphorylation of ATF2 in the Time-Resolved Fluorescence Resonance Energy Transfer (TR-FRET)...
In DepthDetails ArticlePubMed
TargetMitogen-activated protein kinase 8(Homo sapiens (Human))
Burnham Institute For Medical Research
LigandPNGBDBM29296(triazole, 3n)
Affinity DataIC50:  53nMpH: 7.8 T: 2°C. Assay description: Compound was evaluated for its ability to disrupt the interaction of pepJIP1 with JNK1 by using DELFIA assay. DELFIA is a heterogeneous assay whereby...
In DepthDetails ArticlePubMed