BDBM293227 US10106501, Example CT-6
SMILES COC1CCN(CC1)C(=O)c1ccc(Cl)c(Cc2nc3c(C)cc(cn3c2C)C(F)(F)F)c1Cl
InChI Key InChIKey=GISVNJPOTVYTJF-UHFFFAOYSA-N
Data  1 IC50
  Tab Delimited (TSV)   2D SDfile   Computed 3D by Vconf -m prep SDfile
Find this compound or compounds like it in BindingDB:
Activity Spreadsheet -- Enzyme Inhibition Constant Data from BindingDB
Found 1 hit for monomerid = 293227
TargetNuclear receptor ROR-gamma(Homo sapiens (Human))
Abbvie
US Patent
LigandPNGBDBM293227(US10106501, Example CT-6)
Affinity DataIC50: <100nM. Assay description: The primary screen was performed by transient transactivation assays. These cell-based assays were carried out using Cos-7 cells transfected with a c...
Ligand InfoPC cidPC sid
In DepthDetails US Patent