BDBM293286 US10106504, Example 23
SMILES Cc1nc(C)c(-c2ccc3CN(Cc4ccccc4F)CCc3c2)c(-c2ccc3OCCCc3c2)c1[C@H](OC(C)(C)C)C(O)=O
InChI Key InChIKey=WVUAATZVFJFRMS-BHVANESWSA-N
Data  1 EC50
  Tab Delimited (TSV)   2D SDfile   Computed 3D by Vconf -m prep SDfile
Find this compound or compounds like it in BindingDB:
Activity Spreadsheet -- Enzyme Inhibition Constant Data from BindingDB
Found 1 hit for monomerid = 293286
TargetGag-Pol polyprotein [489-587,Q496K](Human immunodeficiency virus type 1)
Viiv Healthcare UK (NO.5)
US Patent
LigandPNGBDBM293286(US10106504, Example 23)
Affinity DataEC50: <100nMpH: 7.55Assay Description:A recombinant NL-RLuc proviral clone was constructed in which a section of the nef gene from NL4-3 was replaced with the Renilla Luciferase gene. Thi...
Ligand InfoPC cidPC sid
In DepthDetails US Patent