BDBM29331 triphenylmethane derivative, 3
SMILES Cc1cc(ccc1N)C(O)(c1ccc(Nc2ccccc2)cc1)c1ccc(Nc2ccc(cc2)S([O-])(=O)=O)cc1
InChI Key InChIKey=OELCCAGECZAVLE-UHFFFAOYSA-M
Data  1 IC50
  Tab Delimited (TSV)   2D SDfile   Computed 3D by Vconf -m prep SDfile
Find this compound or compounds like it in BindingDB:
Activity Spreadsheet -- Enzyme Inhibition Constant Data from BindingDB
Found 1 hit for monomerid = 29331
TargetGenome polyprotein(Hepatitis C virus genotype 1b (isolate Taiwan))
National Taiwan University
LigandPNGBDBM29331(triphenylmethane derivative, 3)
Affinity DataIC50:  1.26E+4nMpH: 7.0 T: 2°C. Assay description: The enzyme was assayed the DNA helicase activity by using DNA substrate (annealed BHQ1-labeled release strand and FITC-labeled template strand) in th...
In DepthDetails ArticlePubMed