BDBM293341 5-cyclopropyl-N-((1r,4r)- 4-(3-(4-methylpiperazin- 1-yl)propanamido) cyclohexyl)isoxazole- 3-carboxamide::US10106510, Compound 10
SMILES CN1CCN(CCC(=O)N[C@H]2CC[C@@H](CC2)NC(=O)c2cc(on2)C2CC2)CC1
InChI Key InChIKey=FZWNBGOYRXYJKG-QAQDUYKDSA-N
Data  1 IC50
  Tab Delimited (TSV)   2D SDfile   Computed 3D by Vconf -m prep SDfile
Find this compound or compounds like it in BindingDB:
Activity Spreadsheet -- Enzyme Inhibition Constant Data from BindingDB
Found 1 hit for monomerid = 293341
TargetHistone-lysine N-methyltransferase SMYD3(Homo sapiens (Human))
Epizyme
US Patent
LigandPNGBDBM293341(5-cyclopropyl-N-((1r,4r)- 4-(3-(4-methylpiperazin-...)
Affinity DataIC50:  7.72E+3nM. Assay description: S-adenosylmethionine (SAM), S-adenosylhomocysteine (SAH), Tris, Tween20, dimethylsulfoxide (DMSO), bovine skin gelatin (BSG), and Tris(2-carboxyethyl...
Ligand InfoPC cidPC sid
In DepthDetails US Patent