BDBM293349 N-((1R,4r)-4-((1r,4R)-4- aminocyclohexane-1- carboxamido)cyclohexyl)- 5-cyclopropylisoxazole- 3-carboxamide::US10106510, Compound 16
SMILES N[C@H]1CC[C@@H](CC1)C(=O)N[C@H]1CC[C@@H](CC1)NC(=O)c1cc(on1)C1CC1
InChI Key InChIKey=FYWDRELRBHCPQQ-BIAGXBKMSA-N
Data  1 IC50
  Tab Delimited (TSV)   2D SDfile   Computed 3D by Vconf -m prep SDfile
Find this compound or compounds like it in BindingDB:
Activity Spreadsheet -- Enzyme Inhibition Constant Data from BindingDB
Found 1 hit for monomerid = 293349
TargetHistone-lysine N-methyltransferase SMYD3(Homo sapiens (Human))
Epizyme
US Patent
LigandPNGBDBM293349(N-((1R,4r)-4-((1r,4R)-4- aminocyclohexane-1- carbo...)
Affinity DataIC50:  606nM. Assay description: S-adenosylmethionine (SAM), S-adenosylhomocysteine (SAH), Tris, Tween20, dimethylsulfoxide (DMSO), bovine skin gelatin (BSG), and Tris(2-carboxyethyl...
Ligand InfoPC cidPC sid
In DepthDetails US Patent