BDBM293400 US10106522, Example 2
SMILES CCOCCOCCN1CCC(CC1)c1nc2ccccc2n1CCOCC
InChI Key InChIKey=GMVKCEUEBPJNQG-UHFFFAOYSA-N
Data  1 IC50
  Tab Delimited (TSV)   2D SDfile   Computed 3D by Vconf -m prep SDfile
Find this compound or compounds like it in BindingDB:
Activity Spreadsheet -- Enzyme Inhibition Constant Data from BindingDB
Found 1 hit for monomerid = 293400
TargetHistamine H1 receptor(Homo sapiens (Human))
Faes Farma
US Patent
LigandPNGBDBM293400(US10106522, Example 2)
Affinity DataIC50:  115nMpH: 7.4 T: 2°C. Assay description: Affinity for histamine H1-receptor was determined by binding studies to H1 receptors. The sample used is a suspension of membranes of CHO cells trans...
Ligand InfoPC cidPC sid
In DepthDetails US Patent