BDBM293497 US10106527, Compound 113::US10544128, Compound 113::US11548872, Compound 113::US20230286945, Compound 113::US9951048, Compound 113
SMILES CN1CCc2cc(ccc2C1)C(=O)Nc1cc2cc(ccc2cn1)-c1cnn(C)c1
InChI Key InChIKey=WVNJESZRHBQOBA-UHFFFAOYSA-N
Data  10 EC50
  Tab Delimited (TSV)   2D SDfile   Computed 3D by Vconf -m prep SDfile
Find this compound or compounds like it in BindingDB:
Activity Spreadsheet -- Enzyme Inhibition Constant Data from BindingDB
Found 10 hits for monomerid = 293497
TargetDual specificity tyrosine-phosphorylation-regulated kinase 1A(Homo sapiens (Human))
Samumed
US Patent
LigandPNGBDBM293497(US10106527, Compound 113 | US10544128, Compound 11...)
Affinity DataEC50:  1.90nMT: 2°C. Assay description: Briefly, recombinant DYRK1A kinase, ATP and Ser/Thr peptide 18 were prepared in 1× Kinase buffer to final concentrations of 0.19 μg/mL, 30 μ...
Ligand InfoPC cidPC sid
In DepthDetails US Patent
TargetGlycogen synthase kinase-3 beta(Homo sapiens (Human))
Samumed
US Patent
LigandPNGBDBM293497(US10106527, Compound 113 | US10544128, Compound 11...)
Affinity DataEC50:  1.71E+3nMT: 2°C. Assay description: Briefly, recombinant GSK3β kinase, ATP and Ser/Thr peptide 09 are prepared in 1× Kinase buffer to final concentrations of 0.04 μg/mL, 46 &#...
Ligand InfoPC cidPC sid
In DepthDetails US Patent
TargetGlycogen synthase kinase-3 beta(Homo sapiens (Human))
Samumed
US Patent
LigandPNGBDBM293497(US10106527, Compound 113 | US10544128, Compound 11...)
Affinity DataEC50:  1.71E+3nM. Assay description: The GSK3β kinase assay is run using the Ser/Thr 09 peptide Z-lyte assay kit according to manufacturer's instructions (Life Technologiesa Div...
Ligand InfoPC cidPC sid
In DepthDetails US Patent
TargetDual specificity tyrosine-phosphorylation-regulated kinase 1A(Homo sapiens (Human))
Samumed
US Patent
LigandPNGBDBM293497(US10106527, Compound 113 | US10544128, Compound 11...)
Affinity DataEC50:  1.90nM. Assay description: The DYRKIA kinase assay was run using the Ser/Thr 18 peptide Z-lyte assay kit according to manufacturer's instructions (Life Technologies-a Divis...
Ligand InfoPC cidPC sid
In DepthDetails US Patent
TargetDual specificity tyrosine-phosphorylation-regulated kinase 1A(Homo sapiens (Human))
Samumed
US Patent
LigandPNGBDBM293497(US10106527, Compound 113 | US10544128, Compound 11...)
Affinity DataEC50:  1.90nM. Assay description: The DYRK1A kinase assay was run using the Ser/Thr 18 peptide Z-lyte assay kit according to manufacturer's instructions (Life Technologies a Divis...
Ligand InfoPC cidPC sid
In DepthDetails US Patent
TargetDual specificity tyrosine-phosphorylation-regulated kinase 1A(Homo sapiens (Human))
Samumed
US Patent
LigandPNGBDBM293497(US10106527, Compound 113 | US10544128, Compound 11...)
Affinity DataEC50:  1.90nM. Assay description: The DYRKIA kinase assay was run using the Ser/Thr 18 peptide Z-lyte assay kit according to manufacturer's instructions (Life Technologies—a Divis...
Ligand InfoPC cidPC sid
In DepthDetails US Patent
TargetGlycogen synthase kinase-3 beta(Homo sapiens (Human))
Samumed
US Patent
LigandPNGBDBM293497(US10106527, Compound 113 | US10544128, Compound 11...)
Affinity DataEC50:  1.71E+3nM. Assay description: The GSK3β kinase assay is run using the Ser/Thr 09 peptide Z-lyte assay kit according to manufacturer's instructions (Life Technologies—a Di...
Ligand InfoPC cidPC sid
In DepthDetails US Patent
TargetDual specificity tyrosine-phosphorylation-regulated kinase 1A(Homo sapiens (Human))
Samumed
US Patent
LigandPNGBDBM293497(US10106527, Compound 113 | US10544128, Compound 11...)
Affinity DataEC50:  1.90nM. Assay description: The DYRKIA kinase assay was run using the Ser/Thr 18 peptide Z-lyte assay kit according to manufacturer's instructions (Life Technologies?a Divis...
Ligand InfoPC cidPC sid
In DepthDetails US Patent
TargetGlycogen synthase kinase-3 beta(Homo sapiens (Human))
Samumed
US Patent
LigandPNGBDBM293497(US10106527, Compound 113 | US10544128, Compound 11...)
Affinity DataEC50:  1.71E+3nM. Assay description: The GSK3β kinase assay is run using the Ser/Thr 09 peptide Z-lyte assay kit according to manufacturer's instructions (Life Technologies a Di...
Ligand InfoPC cidPC sid
In DepthDetails US Patent
TargetProto-oncogene Wnt-1(Homo sapiens (human))
Samumed
US Patent
LigandPNGBDBM293497(US10106527, Compound 113 | US10544128, Compound 11...)
Affinity DataEC50:  120nM. Assay description: The screening assay for Wnt activity is described as follows. Reporter cell lines can be generated by stably transducing cancer cell lines (e.g., col...
Ligand InfoPC cidPC sid
In DepthDetails US Patent