BDBM29375 proline scaffold, 24
SMILES N[C@H](Cc1ccc(Cl)cc1)C(=O)N1CCC[C@H]1C(=O)NCc1cccs1
InChI Key InChIKey=NRAGBHKEKQXCFW-SJORKVTESA-N
Data  1 IC50  1 Kd
  Tab Delimited (TSV)   2D SDfile   Computed 3D by Vconf -m prep SDfile
Find this compound or compounds like it in BindingDB:
Activity Spreadsheet -- Enzyme Inhibition Constant Data from BindingDB
Found 1 hit for monomerid = 29375
TargetProthrombin(Homo sapiens (Human))
University Of Kalmar
LigandPNGBDBM29375(proline scaffold, 24)
Affinity DataIC50:  1.30E+4nM Kd:  2.20E+3nMpH: 7.4 T: 2°C. Assay description: SPR experiments where performed with a Biacore A100 using Series S sensor chip CM5 (GE Healthcare Bio-Sciences AB, Uppsala, Sweden). The proteins wer...
In DepthDetails ArticlePubMed