BDBM293773 3-({[(1R)-6-[(3-cyanophenyl)(methyl)amino]-1,2,3,4-::US10106534, Example 115
SMILES CN(c1cccc(c1)C#N)c1ccc2[C@H](CNc3cnccc3C(O)=O)CCCc2c1
InChI Key InChIKey=FUOARQNCFPISNH-IBGZPJMESA-N
Data  1 IC50
  Tab Delimited (TSV)   2D SDfile   Computed 3D by Vconf -m prep SDfile
Find this compound or compounds like it in BindingDB:
Activity Spreadsheet -- Enzyme Inhibition Constant Data from BindingDB
Found 1 hit for monomerid = 293773
TargetLysine-specific demethylase 4C(Homo sapiens (Human))
Celgene Quanticel Research
US Patent
LigandPNGBDBM293773(3-({[(1R)-6-[(3-cyanophenyl)(methyl)amino]-1,2,3,4...)
Affinity DataIC50:  550nMT: 2°C. Assay description: The ability of test compounds to inhibit the activity of JMJD2C was determined in 384-well plate format under the following reaction conditions: 0.3 ...
Ligand InfoPC cidPC sid
In DepthDetails US Patent