BDBM293873 3-({[(4R)-7-{[4-(cyclopropylmethyl)phenyl](methyl)amino}-3,4-::US10106534, Example 215
SMILES CN(c1ccc(CC2CC2)cc1)c1ccc2[C@H](CNc3cnccc3C(O)=O)CCOc2c1
InChI Key InChIKey=WZGYEFCFBYINDL-FQEVSTJZSA-N
Data  1 IC50
  Tab Delimited (TSV)   2D SDfile   Computed 3D by Vconf -m prep SDfile
Find this compound or compounds like it in BindingDB:
Activity Spreadsheet -- Enzyme Inhibition Constant Data from BindingDB
Found 1 hit for monomerid = 293873
TargetLysine-specific demethylase 4C(Homo sapiens (Human))
Celgene Quanticel Research
US Patent
LigandPNGBDBM293873(3-({[(4R)-7-{[4-(cyclopropylmethyl)phenyl](methyl)...)
Affinity DataIC50:  550nMT: 2°C. Assay description: The ability of test compounds to inhibit the activity of JMJD2C was determined in 384-well plate format under the following reaction conditions: 0.3 ...
Ligand InfoPC cidPC sid
In DepthDetails US Patent