BDBM293911 (S)-1-(3-Fluoro-2- methylphenyl)-N- hydroxy-3-(2- methylpyridin-3- yl)cyclopent-2- enecarboxamide::US10106535, Example 37::US9617259, 37
SMILES Cc1ncccc1C1=C[C@](CC1)(C(=O)NO)c1cccc(F)c1C
InChI Key InChIKey=GQGVQIFPWSLOPP-IBGZPJMESA-N
Data  2 IC50
  Tab Delimited (TSV)   2D SDfile   Computed 3D by Vconf -m prep SDfile
Find this compound or compounds like it in BindingDB:
Activity Spreadsheet -- Enzyme Inhibition Constant Data from BindingDB
Found 2 hits for monomerid = 293911
TargetHistone deacetylase 4(Homo sapiens (Human))
Chdi Foundation
US Patent
LigandPNGBDBM293911((S)-1-(3-Fluoro-2- methylphenyl)-N- hydroxy-3-(2- ...)
Affinity DataIC50:  10nM. Assay description: 2 μl (200×) of each diluted solution and each control (full activity: 100% DMSO alone or full inhibition 1 mM) is stamped into V-bottomed polypr...
Ligand InfoPC cidPC sid
In DepthDetails US Patent
TargetHistone deacetylase 4(Homo sapiens (Human))
Chdi Foundation
US Patent
LigandPNGBDBM293911((S)-1-(3-Fluoro-2- methylphenyl)-N- hydroxy-3-(2- ...)
Affinity DataIC50:  10nM. Assay description: 5 μl of each solution of 1:20 diluted compound from above is transferred to a clear bottomed, black, 384-well assay plate using the Bravo or the...
Ligand InfoPC cidPC sid
In DepthDetails US Patent