BDBM293932 US10106552, Compound 7
SMILES CC1(C)CCc2c(C1)nc1sc(C(N)=O)c(N)c1c2-c1ccc(Cl)o1
InChI Key InChIKey=MYWLCFZCHZCURT-UHFFFAOYSA-N
Data  1 IC50
  Tab Delimited (TSV)   2D SDfile   Computed 3D by Vconf -m prep SDfile
Find this compound or compounds like it in BindingDB:
Activity Spreadsheet -- Enzyme Inhibition Constant Data from BindingDB
Found 1 hit for monomerid = 293932
TargetEukaryotic elongation factor 2 kinase(Homo sapiens (Human))
Longevica Pharmaceuticals
US Patent
LigandPNGBDBM293932(US10106552, Compound 7)
Affinity DataIC50:  1.60E+3nM. Assay description: To determine the IC50 of compounds of the invention, recombinant eEF2K was diluted in an assay buffer in the presence of calmodulin, a calcium-bindin...
Ligand InfoPC cidPC sid
In DepthDetails US Patent