BDBM293946 US10106552, Compound 21
SMILES CC1(C)CCc2nc3sc(C(N)=O)c(N)c3c(-c3ccoc3)c2C1
InChI Key InChIKey=KOHRDHQPWSRGDW-UHFFFAOYSA-N
Data  1 IC50
  Tab Delimited (TSV)   2D SDfile   Computed 3D by Vconf -m prep SDfile
Find this compound or compounds like it in BindingDB:
Activity Spreadsheet -- Enzyme Inhibition Constant Data from BindingDB
Found 1 hit for monomerid = 293946
TargetEukaryotic elongation factor 2 kinase(Homo sapiens (Human))
Longevica Pharmaceuticals
US Patent
LigandPNGBDBM293946(US10106552, Compound 21)
Affinity DataIC50:  2.00E+3nM. Assay description: To determine the IC50 of compounds of the invention, recombinant eEF2K was diluted in an assay buffer in the presence of calmodulin, a calcium-bindin...
Ligand InfoPC cidPC sid
In DepthDetails US Patent