BDBM293957 US10106552, Compound 32
SMILES Cc1csc(n1)-c1c2CCC(C)(C)c2nc2sc(C(N)=O)c(N)c12
InChI Key InChIKey=HPFXFGIOEWMPDK-UHFFFAOYSA-N
Data  1 IC50
  Tab Delimited (TSV)   2D SDfile   Computed 3D by Vconf -m prep SDfile
Find this compound or compounds like it in BindingDB:
Activity Spreadsheet -- Enzyme Inhibition Constant Data from BindingDB
Found 1 hit for monomerid = 293957
TargetEukaryotic elongation factor 2 kinase(Homo sapiens (Human))
Longevica Pharmaceuticals
US Patent
LigandPNGBDBM293957(US10106552, Compound 32)
Affinity DataIC50:  3.80E+3nM. Assay description: To determine the IC50 of compounds of the invention, recombinant eEF2K was diluted in an assay buffer in the presence of calmodulin, a calcium-bindin...
Ligand InfoPC cidPC sid
In DepthDetails US Patent