BDBM293988 (2S)-5-(2-(4-((3-(2,6- Dimethylphenyl)benzo[b] thiophen-5-yl)methoxy)phenyl) pent-3-yn-1-yl)-1H-tetrazole::US10106553, Compound 20
SMILES CC#C[C@@H](Cc1nnn[nH]1)c1ccc(OCc2ccc3scc(-c4c(C)cccc4C)c3c2)cc1
InChI Key
Data  1 EC50
  Tab Delimited (TSV)   2D SDfile   Computed 3D by Vconf -m prep SDfile
Find this compound or compounds like it in BindingDB:
Activity Spreadsheet -- Enzyme Inhibition Constant Data from BindingDB
Found 1 hit for monomerid = 293988
TargetFree fatty acid receptor 1(Homo sapiens (Human))
Janssen Pharmaceutica
US Patent
LigandPNGBDBM293988((2S)-5-(2-(4-((3-(2,6- Dimethylphenyl)benzo[b] thi...)
Affinity DataEC50:  24nMT: 2°C. Assay description: Compounds were tested in a calcium flux assay using transfected HEK293 cells stably expressing either human GPR40 or rat GPR40. Human GPR40 expressin...
Ligand InfoPC cidPC sid
In DepthDetails US Patent