BDBM294145 US9586900, Example 48
SMILES CCS(=O)(=O)C[C@@H](O)COc1ccc(cc1OC)N1CCC(Oc2ccc(cc2)-c2ccccc2)C1=O
InChI Key InChIKey=UJSXLNFHWJCHCA-ZZHFZYNASA-N
Data  1 KI
  Tab Delimited (TSV)   2D SDfile   Computed 3D by Vconf -m prep SDfile
Find this compound or compounds like it in BindingDB:
Activity Spreadsheet -- Enzyme Inhibition Constant Data from BindingDB
Found 1 hit for monomerid = 294145
TargetMelanin-concentrating hormone receptor 1(Homo sapiens (Human))
Bristol-Myers Squibb
US Patent
LigandPNGBDBM294145(US9586900, Example 48)
Affinity DataKi:  5nMpH: 7.4Assay Description:An in vitro binding assay was used to determine the compound Ki value or ability to antagonize binding of a peptide agonist to the human melanin conc...
Ligand InfoPC cidPC sid
In DepthDetails US Patent