BDBM294212 US9586900, Example 116
SMILES COc1cc(ccc1OCC(C)(C)O)N1CC=C(Oc2ccc(cc2)C2CC2)C1=O
InChI Key InChIKey=MPHXIKPLROVQAS-UHFFFAOYSA-N
Data  1 KI
  Tab Delimited (TSV)   2D SDfile   Computed 3D by Vconf -m prep SDfile
Find this compound or compounds like it in BindingDB:
Activity Spreadsheet -- Enzyme Inhibition Constant Data from BindingDB
Found 1 hit for monomerid = 294212
TargetMelanin-concentrating hormone receptor 1(Homo sapiens (Human))
Bristol-Myers Squibb
US Patent
LigandPNGBDBM294212(US9586900, Example 116)
Affinity DataKi:  3nMpH: 7.4Assay Description:An in vitro binding assay was used to determine the compound Ki value or ability to antagonize binding of a peptide agonist to the human melanin conc...
Ligand InfoPC cidPC sid
In DepthDetails US Patent